Unnamed: 0,Unnamed: 1,Unnamed: 2,Unnamed: 3,Unnamed: 4,Unnamed: 5,Unnamed: 6,Unnamed: 7,Unnamed: 8,Unnamed: 9,Unnamed: 10,Unnamed: 11,Unnamed: 12,Unnamed: 13,Unnamed: 14,Unnamed: 15,Unnamed: 16,Unnamed: 17,Unnamed: 18,Unnamed: 19,Unnamed: 20,Unnamed: 21,Unnamed: 22,Unnamed: 23,Unnamed: 24,Unnamed: 25,Unnamed: 26,Unnamed: 27,Unnamed: 28
,,,,,,,,,,,,,,,,,,,,,,,,,,,,
,Fig. 4B,,,,,,,,,,,,,,,,,Fig. 4D,,,,,,,,,,
,,Group-ID,ID/Case No,No. of active microglia/100 µM2,,,,Group-ID,ID/Case No,No. of F.Jade positive neuronal cells/mm2,,,,,,,,,,Group-ID,ID/Case No,No. of IL-6 positive cells/100 µM2,,,,Group-ID,ID/Case No,No. of IL-6 positive cells/100 µM2
,Group-1,Cov NND,6609,10,,,Group3,Cov  ND,6435,11,,,,,,,,,Group-1,Cov NND,6609,1.189767995,,,Group3,Cov  ND,6435,2.37953599
,,,,7,,,,,,16,,,,,,,,,,,,1.427721594,,,,,,3.569303986
,,,,8,,,,,,10,,,,,,,,,,,,1.665675193,,,,,,4.045211184
,,,6436,11,,,,,5922,19,,,,,,,,,,,6436,1.427721594,,,,,5922,2.855443189
,,,,8,,,,,,11,,,,,,,,,,,,1.903628792,,,,,,2.37953599
,,,,12,,,,,,9,,,,,,,,,,,,1.665675193,,,,,,1.903628792
,,,6437,8,,,,,6782,9,,,,,,,,,,,6437,1.665675193,,,,,6782,3.093396788
,,,,5,,,,,,8,,,,,,,,,,,,1.427721594,,,,,,2.855443189
,,,,7,,,,,,6,,,,,,,,,,,,1.665675193,,,,,,2.141582391
,,,3160,6,,,,,6783,9,,,,,,,,,,,3160,1.189767995,,,,,6783,1.903628792
,,,,7,,,,,,5,,,,,,,,,,,,0.951814396,,,,,,1.903628792
,,,,5,,,,,,6,,,,,,,,,,,,0.713860797,,,,,,2.141582391
,,,3162,3,,,,,6795,11,,,,,,,,,,,3162,0.951814396,,,,,6795,1.903628792
,,,,4,,,,,,5,,,,,,,,,,,,0.713860797,,,,,,2.141582391
,,,,3,,,,,,9,,,,,,,,,,,,0.951814396,,,,,,1.665675193
,,,3166,5,,,,,,,,,,,,,,,,,3166,0.951814396,,,,,,
,,,,5,,,Group-4,Non-Cov ND,5872,5,,,,,,,,,,,,0.475907198,,,Group-4,Non-Cov ND,5872,1.665675193
,,,,5,,,,,,8,,,,,,,,,,,,0.713860797,,,,,,1.427721594
,,,3170,4,,,,,,3,,,,,,,,,,,3170,1.665675193,,,,,,1.665675193
,,,,7,,,,,6207,5,,,,,,,,,,,,1.189767995,,,,,6207,0.713860797
,,,,6,,,,,,4,,,,,,,,,,,,1.665675193,,,,,,1.189767995
,,,3180,5,,,,,,8,,,,,,,,,,,3180,0.713860797,,,,,,1.427721594
,,,,4,,,,,6225,2,,,,,,,,,,,,1.189767995,,,,,6225,0
,,,,2,,,,,,3,,,,,,,,,,,,0.713860797,,,,,,0
,,,3193,5,,,,,,2,,,,,,,,,,,3193,0.713860797,,,,,,0.237953599
,,,,6,,,,,6384,4,,,,,,,,,,,,0.951814396,,,,,6384,0.713860797
,,,,4,,,,,,5,,,,,,,,,,,,0.713860797,,,,,,0.237953599
,,,6576,5,,,,,,4,,,,,,,,,,,6576,1.427721594,,,,,,0.475907198
,,,,4,,,,,6632,1,,,,,,,,,,,,1.189767995,,,,,6632,0.951814396
,,,,5,,,,,,2,,,,,,,,,,,,1.427721594,,,,,,1.427721594
,,,5932,10,,,,,,1,,,,,,,,,,,5932,1.427721594,,,,,,0.713860797
,,,,9,,,,,,,,,,,,,,,,,,0.951814396,,,,,,
,,,,9,,,,,,,,,,,,,,,,,,1.665675193,,,,,,
,,,3177,8,,,,,,,,,,,,,,,,,,,,,,,,
,,,,7,,,,,,,,,,,,,,,,,,,,,,,,
,,,,6,,,,,,,,,,,,,,,,,,,,,,,,
,,,,,,,,,,,,,,,,,,,,,,,,,,,,
,Group-2,Non-Cov NND,5934,1,,,,,,,,,,,,,,,Group-2,Non-Cov NND,5934,0.237953599,,,,,,
,,,,0,,,,,,,,,,,,,,,,,,0,,,,,,
,,,,0,,,,,,,,,,,,,,,,,,0.237953599,,,,,,
,,,5654,0,,,,,,,,,,,,,,,,,5654,0,,,,,,
,,,,1,,,,,,,,,,,,,,,,,,0,,,,,,
,,,,0,,,,,,,,,,,,,,,,,,0,,,,,,
,,,6061,3,,,,,,,,,,,,,,,,,6061,0,,,,,,
,,,,1,,,,,,,,,,,,,,,,,,0.237953599,,,,,,
,,,,0,,,,,,,,,,,,,,,,,,0,,,,,,
,,,6062,0,,,,,,,,,,,,,,,,,6062,0.237953599,,,,,,
,,,,1,,,,,,,,,,,,,,,,,,0,,,,,,
,,,,0,,,,,,,,,,,,,,,,,,0,,,,,,
,,,6212,2,,,,,,,,,,,,,,,,,6212,0.237953599,,,,,,
,,,,3,,,,,,,,,,,,,,,,,,0.237953599,,,,,,
,,,,1,,,,,,,,,,,,,,,,,,0.237953599,,,,,,
,,,6381,4,,,,,,,,,,,,,,,,,6381,0.237953599,,,,,,
,,,,1,,,,,,,,,,,,,,,,,,0.475907198,,,,,,
,,,,0,,,,,,,,,,,,,,,,,,0.237953599,,,,,,
,,,6168,1,,,,,,,,,,,,,,,,,6168,0.237953599,,,,,,
,,,,2,,,,,,,,,,,,,,,,,,0,,,,,,
,,,,5,,,,,,,,,,,,,,,,,,0.237953599,,,,,,
,,,6173,1,,,,,,,,,,,,,,,,,6173,0,,,,,,
,,,,0,,,,,,,,,,,,,,,,,,0,,,,,,
,,,,3,,,,,,,,,,,,,,,,,,0,,,,,,
,,,6235,1,,,,,,,,,,,,,,,,,6235,0,,,,,,
,,,,0,,,,,,,,,,,,,,,,,,0,,,,,,
,,,,0,,,,,,,,,,,,,,,,,,0,,,,,,
,,,6274,1,,,,,,,,,,,,,,,,,6274,0,,,,,,
,,,,1,,,,,,,,,,,,,,,,,,0,,,,,,
,,,,0,,,,,,,,,,,,,,,,,,0,,,,,,
,,,6173,2,,,,,,,,,,,,,,,,,6173,0.237953599,,,,,,
,,,,1,,,,,,,,,,,,,,,,,,0,,,,,,
,,,,1,,,,,,,,,,,,,,,,,,0,,,,,,
,,,6307,1,,,,,,,,,,,,,,,,,6307,0,,,,,,
,,,,2,,,,,,,,,,,,,,,,,,0,,,,,,
,,,,1,,,,,,,,,,,,,,,,,,0,,,,,,
